Scehduled tests not running after latest update

3 posts, 0 answers
  1. Robert
    Robert avatar
    4 posts
    Member since:
    Jan 2015

    Posted 17 Jul 2015 Link to this post

    I'm having a problem, after the latest update, with my scheduled tests not running.  Before the the update I had no problem as and they were running on time and sending results notifications.  After the update, I went in an rescheduled al my tests (after they did not run for a couple of days) - set up email results notification , as before, but still no luck.  Anyone else having this same problem?

     

    Thanks,

    Robert

  2. Madhu
    Madhu avatar
    23 posts
    Member since:
    Dec 2010

    Posted 18 Jul 2015 Link to this post

    Hello Support,

     

    I'm also on same page. My scheduled test lists are not executing after the 2015.2.715 upgrade. It use to work fine until 2015.1.528 version. I uninstalled complete product and reinstalled, but no use. I see below log under help section. We are not using TFS server, seems TestRunner looking for TFS server?

     

    [07/18 10:15:43,Telerik.TestStudio.exe(4732:1)] First trace message from process 4732: "C:\Program Files (x86)\Telerik\Test Studio\Bin\Telerik.TestStudio.exe"
    [07/18 10:15:43,Telerik.TestStudio.exe(4732:1)] First trace message from foreground unnamed thread (managed ID = 1, native ID = 3948).
    [07/18 10:15:43,Telerik.TestStudio.exe(4732:1),Error] RegistryHelper.PerformActionOnCurrentKey() : Cannot locate HKEY_LOCAL_MACHINE\SOFTWARE\Microsoft\DevDiv\vs\Servicing\10.0\VSTSCore
    [07/18 10:15:43,Telerik.TestStudio.exe(4732:1),Error] RegistryHelper.PerformActionOnCurrentKey() : Cannot locate HKEY_LOCAL_MACHINE\SOFTWARE\Microsoft\DevDiv\vs\Servicing\10.0\VSTDCore
    [07/18 10:15:43,Telerik.TestStudio.exe(4732:1),Error] RegistryHelper.PerformActionOnCurrentKey() : Cannot locate HKEY_LOCAL_MACHINE\SOFTWARE\Microsoft\DevDiv\vs\Servicing\10.0\PROCore
    [07/18 10:15:44,Telerik.TestStudio.exe(4732:1),Analytics] ActivityLog.LogError() : Feature track failed!
    [07/18 10:15:44,Telerik.TestStudio.exe(4732:1),Analytics] ActivityLog.LogError() : Feature track failed!
    [07/18 10:16:38,Telerik.TestStudio.Desktop.exe(2756:1)] First trace message from process 2756: "C:\Program Files (x86)\Telerik\Test Studio\Bin\Telerik.TestStudio.Desktop.exe" False "D:\BurnSitesBackupTest" /trial
    [07/18 10:16:38,Telerik.TestStudio.Desktop.exe(2756:1)] First trace message from foreground thread "Application start thread" (managed ID = 1, native ID = 4916).
    [07/18 10:16:38,Telerik.TestStudio.Desktop.exe(2756:1),Uncategorized] App.OnStartup() :
         Using: Telerik.TestStudio.Core, Version=2015.2.715.0, Culture=neutral, PublicKeyToken=4fd5f65be123776c
         OS: Microsoft Windows 7 Professional 64-bit 6.1.7601 Service Pack 1
         .NET version: 4.0.30319.18444
    [07/18 10:16:38,Telerik.TestStudio.Scheduling.Client.exe(4124:1)] First trace message from process 4124: "C:\Program Files (x86)\Telerik\Test Studio\Bin\Telerik.TestStudio.Scheduling.Client.exe" /EmbedExecutionManager /EmbedProcessManager
    [07/18 10:16:38,Telerik.TestStudio.Scheduling.Client.exe(4124:1)] First trace message from foreground unnamed thread (managed ID = 1, native ID = 2124).
    [07/18 10:16:38,Telerik.TestStudio.Scheduling.Client.exe(4124:1),TestStudio] Loader.LoadTranslatorGroups() : ------- Function Start -------
    [07/18 10:16:39,Telerik.TestStudio.Scheduling.Client.exe(4124:1),TestStudio] Loader.LoadTranslatorGroups() : ------- Function End -------
    [07/18 10:16:41,Telerik.TestStudio.Desktop.exe(2756:1),Uncategorized] Orchestrator.LoadPackages() : Telerik.TestStudio.Load.LoadPkg implements ITestStudioPkg and was added as a package.
    [07/18 10:16:41,Telerik.TestStudio.Desktop.exe(2756:1),Uncategorized] Orchestrator.LoadPackages() : Telerik.TestStudio.Manual.ManualPkg implements ITestStudioPkg and was added as a package.
    [07/18 10:16:41,Telerik.TestStudio.Desktop.exe(2756:1),Uncategorized] Orchestrator.LoadPackages() : Telerik.TestStudio.Web.WebPkg implements ITestStudioPkg and was added as a package.
    [07/18 10:16:41,Telerik.TestStudio.Desktop.exe(2756:1),Uncategorized] Orchestrator.LoadPackages() : Telerik.TestStudio.Wpf.WpfPkg implements ITestStudioPkg and was added as a package.
    [07/18 10:16:41,Telerik.TestStudio.Desktop.exe(2756:4)] First trace message from pool unnamed thread (managed ID = 4, native ID = 3772).
    [07/18 10:16:41,Telerik.TestStudio.Desktop.exe(2756:4),TestStudio] Loader.LoadTranslatorGroups() : ------- Function Start -------
    [07/18 10:16:41,Telerik.TestStudio.Desktop.exe(2756:1),Performance] PerformanceProfileViewModel.set_ViewingTimeRange() : Viewing time range overwritten: 7/18/2015 1:16:41 PM to 7/18/2015 1:16:41 PM.
    [07/18 10:16:41,Telerik.TestStudio.Desktop.exe(2756:1),Performance] PerformanceProfileViewModel.set_ViewingTimeRange() : Viewing time range overwritten: 7/18/2015 1:16:41 PM to 7/18/2015 1:16:41 PM.
    [07/18 10:16:41,Telerik.TestStudio.Desktop.exe(2756:4),TestStudio] Loader.LoadTranslatorGroups() : ------- Function End -------
    [07/18 10:16:41,Telerik.TestStudio.Desktop.exe(2756:6)] First trace message from pool unnamed thread (managed ID = 6, native ID = 3104).
    [07/18 10:16:41,Telerik.TestStudio.Desktop.exe(2756:6),Recording] RecorderHostService constructor : Host endpoint: net.pipe://localhost/Instance/49554/DesignCanvas/2756
    [07/18 10:16:42,Telerik.TestStudio.Desktop.exe(2756:1),TestStudio] MainWindow.MainWindow_Loaded() : Test Studio (version:2015.2.715.0) started.
    [07/18 10:16:42,Telerik.TestStudio.Scheduling.Client.exe(4124:1),Execution] TabControlViewModel constructor : Attempted to start a new scheduling server, but detected an already operational one.... using existing
    [07/18 10:16:42,Telerik.TestStudio.Scheduling.Client.exe(4124:1),Execution] ProcessManager.StartProcess() : Starting profiler
    [07/18 10:16:42,Telerik.TestStudio.Scheduling.Client.exe(4124:1),Execution] ProcessManager.CreateNativeProcess() : Started profiler:4524 url= http://wks-2d1nm22.ais.atlanticinfo.com:8031/
    [07/18 10:16:42,Telerik.TestStudio.Scheduling.Client.exe(4124:1),Execution] ProcessManager.StartProcess() : Starting executor
    [07/18 10:16:42,Telerik.TestStudio.Desktop.exe(2756:1),Analytics] ActivityLog.LogError() : Feature track failed!
    [07/18 10:16:42,Telerik.TestStudio.Scheduling.Client.exe(4124:1),Execution] ProcessManager.CreateNativeProcess() : Started executor:1696 url= http://wks-2d1nm22.ais.atlanticinfo.com:8032/
    [07/18 10:16:42,Telerik.TestStudio.Desktop.exe(2756:1),Analytics] ActivityLog.LogError() : Feature track failed!
    [07/18 10:16:42,Telerik.TestStudio.Desktop.exe(2756:1),Analytics] ActivityLog.LogError() : LogMessage failed
    [07/18 10:16:42,Telerik.TestStudio.Desktop.exe(2756:1),Analytics] ActivityLog.LogError() : Track feature start failed!
    [07/18 10:16:43,Telerik.TestStudio.Profiler.exe(4524:1)] First trace message from process 4524: "Telerik.TestStudio.Profiler.exe" "http://wks-2d1nm22.ais.atlanticinfo.com:8031/" ""
    [07/18 10:16:43,Telerik.TestStudio.Profiler.exe(4524:1)] First trace message from foreground unnamed thread (managed ID = 1, native ID = 4828).
    [07/18 10:16:43,Telerik.TestStudio.Profiler.exe(4524:1),Execution] WcfHttpRawCommunicationLayer.Start() : Starting WCF Service with RawHTTP Bindings at http://wks-2d1nm22.ais.atlanticinfo.com:8031/
    [07/18 10:16:43,Telerik.TestStudio.RemoteExecutor.exe(1696:1)] First trace message from process 1696: "Telerik.TestStudio.RemoteExecutor.exe" "http://wks-2d1nm22.ais.atlanticinfo.com:8032/" ""
    [07/18 10:16:43,Telerik.TestStudio.RemoteExecutor.exe(1696:1)] First trace message from foreground unnamed thread (managed ID = 1, native ID = 4620).
    [07/18 10:16:43,Telerik.TestStudio.RemoteExecutor.exe(1696:1),TestStudio] Loader.LoadTranslatorGroups() : ------- Function Start -------
    [07/18 10:16:43,Telerik.TestStudio.RemoteExecutor.exe(1696:1),TestStudio] Loader.LoadTranslatorGroups() : ------- Function End -------
    [07/18 10:16:44,Telerik.TestStudio.Desktop.exe(2756:12)] First trace message from pool unnamed thread (managed ID = 12, native ID = 3240).
    [07/18 10:16:44,Telerik.TestStudio.Desktop.exe(2756:12),Uncategorized] BugTrackersLoader.LoadSystems() : ------- Function Start -------
    [07/18 10:16:44,Telerik.TestStudio.Desktop.exe(2756:12),Error] <>c__DisplayClass4.<RegisterResolver>b__1() : EXCEPTION! (see below)
         Situation: Exception trying to resolve dependency: Microsoft.TeamFoundation.Client, Version=9.0.0.0, Culture=neutral, PublicKeyToken=b03f5f7f11d50a3a
         Outer Exception Type: System.IO.FileNotFoundException
         Message: Could not load file or assembly 'Microsoft.TeamFoundation.Client, Version=12.0.0.0, Culture=neutral, PublicKeyToken=b03f5f7f11d50a3a' or one of its dependencies. The system cannot find the file specified.
         HRESULT: 0x80070002 (Official ID (if app.) = 2147942402, Error Bit = FAILED, Facility = FACILITY_WIN32, Code = ERROR_FILE_NOT_FOUND)
         Call Stack:
              at System.Reflection.RuntimeAssembly._nLoad(AssemblyName fileName, String codeBase, Evidence assemblySecurity, RuntimeAssembly locationHint, StackCrawlMark& stackMark, IntPtr pPrivHostBinder, Boolean throwOnFileNotFound, Boolean forIntrospection, Boolean suppressSecurityChecks)
              at System.Reflection.RuntimeAssembly.nLoad(AssemblyName fileName, String codeBase, Evidence assemblySecurity, RuntimeAssembly locationHint, StackCrawlMark& stackMark, IntPtr pPrivHostBinder, Boolean throwOnFileNotFound, Boolean forIntrospection, Boolean suppressSecurityChecks)
              at System.Reflection.RuntimeAssembly.InternalLoadAssemblyName(AssemblyName assemblyRef, Evidence assemblySecurity, RuntimeAssembly reqAssembly, StackCrawlMark& stackMark, IntPtr pPrivHostBinder, Boolean throwOnFileNotFound, Boolean forIntrospection, Boolean suppressSecurityChecks)
              at System.Reflection.RuntimeAssembly.InternalLoad(String assemblyString, Evidence assemblySecurity, StackCrawlMark& stackMark, IntPtr pPrivHostBinder, Boolean forIntrospection)
              at System.Reflection.RuntimeAssembly.InternalLoad(String assemblyString, Evidence assemblySecurity, StackCrawlMark& stackMark, Boolean forIntrospection)
              at System.Reflection.Assembly.Load(String assemblyString)
              at ArtOfTest.Common.BaseDependencyLoader.<>c__DisplayClass4.<RegisterResolver>b__1(Object o, ResolveEventArgs e)
    [07/18 10:16:44,Telerik.TestStudio.Desktop.exe(2756:12),Error] <>c__DisplayClass4.<RegisterResolver>b__1() : EXCEPTION! (see below)
         Situation: Exception trying to resolve dependency: Microsoft.TeamFoundation.Client, Version=11.0.0.0, Culture=neutral, PublicKeyToken=b03f5f7f11d50a3a
         Outer Exception Type: System.IO.FileNotFoundException
         Message: Could not load file or assembly 'Microsoft.TeamFoundation.Client, Version=9.0.0.0, Culture=neutral, PublicKeyToken=b03f5f7f11d50a3a' or one of its dependencies. The system cannot find the file specified.
         HRESULT: 0x80070002 (Official ID (if app.) = 2147942402, Error Bit = FAILED, Facility = FACILITY_WIN32, Code = ERROR_FILE_NOT_FOUND)
         Call Stack:
              at System.Reflection.RuntimeAssembly._nLoad(AssemblyName fileName, String codeBase, Evidence assemblySecurity, RuntimeAssembly locationHint, StackCrawlMark& stackMark, IntPtr pPrivHostBinder, Boolean throwOnFileNotFound, Boolean forIntrospection, Boolean suppressSecurityChecks)
              at System.Reflection.RuntimeAssembly.nLoad(AssemblyName fileName, String codeBase, Evidence assemblySecurity, RuntimeAssembly locationHint, StackCrawlMark& stackMark, IntPtr pPrivHostBinder, Boolean throwOnFileNotFound, Boolean forIntrospection, Boolean suppressSecurityChecks)
              at System.Reflection.RuntimeAssembly.InternalLoadAssemblyName(AssemblyName assemblyRef, Evidence assemblySecurity, RuntimeAssembly reqAssembly, StackCrawlMark& stackMark, IntPtr pPrivHostBinder, Boolean throwOnFileNotFound, Boolean forIntrospection, Boolean suppressSecurityChecks)
              at System.Reflection.RuntimeAssembly.InternalLoad(String assemblyString, Evidence assemblySecurity, StackCrawlMark& stackMark, IntPtr pPrivHostBinder, Boolean forIntrospection)
              at System.Reflection.RuntimeAssembly.InternalLoad(String assemblyString, Evidence assemblySecurity, StackCrawlMark& stackMark, Boolean forIntrospection)
              at System.Reflection.Assembly.Load(String assemblyString)
              at ArtOfTest.Common.BaseDependencyLoader.<>c__DisplayClass4.<RegisterResolver>b__1(Object o, ResolveEventArgs e)
    [07/18 10:16:44,Telerik.TestStudio.Desktop.exe(2756:12),Error] <>c__DisplayClass4.<RegisterResolver>b__1() : EXCEPTION! (see below)
         Situation: Exception trying to resolve dependency: Microsoft.TeamFoundation.Client, Version=10.0.0.0, Culture=neutral, PublicKeyToken=b03f5f7f11d50a3a
         Outer Exception Type: System.IO.FileNotFoundException
         Message: Could not load file or assembly 'Microsoft.TeamFoundation.Client, Version=11.0.0.0, Culture=neutral, PublicKeyToken=b03f5f7f11d50a3a' or one of its dependencies. The system cannot find the file specified.
         HRESULT: 0x80070002 (Official ID (if app.) = 2147942402, Error Bit = FAILED, Facility = FACILITY_WIN32, Code = ERROR_FILE_NOT_FOUND)
         Call Stack:
              at System.Reflection.RuntimeAssembly._nLoad(AssemblyName fileName, String codeBase, Evidence assemblySecurity, RuntimeAssembly locationHint, StackCrawlMark& stackMark, IntPtr pPrivHostBinder, Boolean throwOnFileNotFound, Boolean forIntrospection, Boolean suppressSecurityChecks)
              at System.Reflection.RuntimeAssembly.nLoad(AssemblyName fileName, String codeBase, Evidence assemblySecurity, RuntimeAssembly locationHint, StackCrawlMark& stackMark, IntPtr pPrivHostBinder, Boolean throwOnFileNotFound, Boolean forIntrospection, Boolean suppressSecurityChecks)
              at System.Reflection.RuntimeAssembly.InternalLoadAssemblyName(AssemblyName assemblyRef, Evidence assemblySecurity, RuntimeAssembly reqAssembly, StackCrawlMark& stackMark, IntPtr pPrivHostBinder, Boolean throwOnFileNotFound, Boolean forIntrospection, Boolean suppressSecurityChecks)
              at System.Reflection.RuntimeAssembly.InternalLoad(String assemblyString, Evidence assemblySecurity, StackCrawlMark& stackMark, IntPtr pPrivHostBinder, Boolean forIntrospection)
              at System.Reflection.RuntimeAssembly.InternalLoad(String assemblyString, Evidence assemblySecurity, StackCrawlMark& stackMark, Boolean forIntrospection)
              at System.Reflection.Assembly.Load(String assemblyString)
              at ArtOfTest.Common.BaseDependencyLoader.<>c__DisplayClass4.<RegisterResolver>b__1(Object o, ResolveEventArgs e)
    [07/18 10:16:44,Telerik.TestStudio.Desktop.exe(2756:12),Error] BugTrackersLoader.LoadSystems() : Telerik.TestStudio.TFSBugTracker.TFSBugTracker could not be instantiated. Exception: Exception has been thrown by the target of an invocation.
    [07/18 10:16:44,Telerik.TestStudio.Scheduling.Client.exe(4124:11)] First trace message from pool unnamed thread (managed ID = 11, native ID = 3624).
    [07/18 10:16:44,Telerik.TestStudio.Scheduling.Client.exe(4124:11),Error] WcfHttpRawRequest.Send() : EXCEPTION! (see below)
         Outer Exception Type: System.Net.WebException
         Message: Unable to connect to the remote server
         HRESULT: 0x80131509 (Official ID (if app.) = COR_E_INVALIDOPERATION, Error Bit = FAILED, Facility = FACILITY_URT, Code = 5385)
         Call Stack:
              at System.Net.HttpWebRequest.GetResponse()
              at ArtOfTest.WebAii.Messaging.Http.WcfHttpRawRequest.Send()
         Inner Exception Type: System.Net.Sockets.SocketException
         Message: No connection could be made because the target machine actively refused it 172.16.234.117:8032
         HRESULT: 0x80004005 (Official ID (if app.) = E_FAIL, Error Bit = FAILED, Facility = FACILITY_NULL, Code = 16389)
         Call Stack:
              at System.Net.Sockets.Socket.DoConnect(EndPoint endPointSnapshot, SocketAddress socketAddress)
              at System.Net.ServicePoint.ConnectSocketInternal(Boolean connectFailure, Socket s4, Socket s6, Socket& socket, IPAddress& address, ConnectSocketState state, IAsyncResult asyncResult, Exception& exception)
    [07/18 10:16:44,Telerik.TestStudio.Scheduling.Client.exe(4124:11),Execution] <>c__DisplayClass10.<BeginPingingProcesses>b__b() : 1696 failed ping 1 times. Not dropping.
    [07/18 10:16:45,Telerik.TestStudio.Desktop.exe(2756:1),Uncategorized] Orchestrator.set_SelectedProject() : Active Project is : 'BurnSitesBackupTest'
    [07/18 10:16:45,Telerik.TestStudio.Desktop.exe(2756:1),Uncategorized] Orchestrator._iUIProject_ProjectOpened() : Project 'BurnSitesBackupTest' Ready.
    [07/18 10:16:45,Telerik.TestStudio.Desktop.exe(2756:6),TestStudio] <>c__DisplayClasse.<LoadInternal>b__9() : Extract elements/build elements tree time: 00:00:00.2856881
    [07/18 10:16:45,Telerik.TestStudio.Desktop.exe(2756:6),TestStudio] <>c__DisplayClasse.<LoadInternal>b__9() : Total Elements count: 63
    [07/18 10:16:55,Telerik.TestStudio.Desktop.exe(2756:12),Uncategorized] <>c__DisplayClassd.<Refresh>b__5() : Enumerating test list files in "D:\BurnSitesBackupTest\TestLists"...
    [07/18 10:16:55,Telerik.TestStudio.Desktop.exe(2756:12),Uncategorized] <>c__DisplayClassd.<Refresh>b__5() : 4 test lists found.
    [07/18 10:16:55,Telerik.TestStudio.Desktop.exe(2756:15)] First trace message from pool unnamed thread (managed ID = 15, native ID = 4472).
    [07/18 10:16:55,Telerik.TestStudio.Desktop.exe(2756:15),Uncategorized] <>c__DisplayClassd.<Refresh>b__9() : All files parsed and 4 viewmodels added.
    [07/18 10:16:57,Telerik.TestStudio.Desktop.exe(2756:1),Error] RegistryHelper.PerformActionOnCurrentKey() : Cannot locate HKEY_LOCAL_MACHINE\SOFTWARE\Microsoft\DevDiv\vs\Servicing\10.0\VSTSCore
    [07/18 10:16:57,Telerik.TestStudio.Desktop.exe(2756:1),Error] RegistryHelper.PerformActionOnCurrentKey() : Cannot locate HKEY_LOCAL_MACHINE\SOFTWARE\Microsoft\DevDiv\vs\Servicing\10.0\VSTDCore
    [07/18 10:16:57,Telerik.TestStudio.Desktop.exe(2756:1),Error] RegistryHelper.PerformActionOnCurrentKey() : Cannot locate HKEY_LOCAL_MACHINE\SOFTWARE\Microsoft\DevDiv\vs\Servicing\10.0\PROCore
    [07/18 10:16:57,Telerik.TestStudio.Desktop.exe(2756:1),Error] RegistryHelper.PerformActionOnCurrentKey() : Cannot locate HKEY_LOCAL_MACHINE\SOFTWARE\Microsoft\DevDiv\vs\Servicing\11.0\ultimate
    [07/18 10:16:57,Telerik.TestStudio.Desktop.exe(2756:1),Error] RegistryHelper.PerformActionOnCurrentKey() : Cannot locate HKEY_LOCAL_MACHINE\SOFTWARE\Microsoft\DevDiv\vs\Servicing\11.0\premium
    [07/18 10:16:57,Telerik.TestStudio.Desktop.exe(2756:1),Error] RegistryHelper.PerformActionOnCurrentKey() : Cannot locate HKEY_LOCAL_MACHINE\SOFTWARE\Microsoft\DevDiv\vs\Servicing\11.0\professional
    [07/18 10:16:57,Telerik.TestStudio.Desktop.exe(2756:1),Error] RegistryHelper.PerformActionOnCurrentKey() : Cannot locate HKEY_LOCAL_MACHINE\SOFTWARE\Microsoft\DevDiv\vs\Servicing\12.0\ultimate
    [07/18 10:16:57,Telerik.TestStudio.Desktop.exe(2756:1),Error] RegistryHelper.PerformActionOnCurrentKey() : Cannot locate HKEY_LOCAL_MACHINE\SOFTWARE\Microsoft\DevDiv\vs\Servicing\12.0\premium
    [07/18 10:16:57,Telerik.TestStudio.Desktop.exe(2756:1),Error] RegistryHelper.PerformActionOnCurrentKey() : Cannot locate HKEY_LOCAL_MACHINE\SOFTWARE\Microsoft\DevDiv\vs\Servicing\12.0\professional
    [07/18 10:17:39,Telerik.TestStudio.Desktop.exe(2756:1),ProjectModel] StandaloneHost.EditControlledFiles() : ------- Function Start -------
    [07/18 10:17:39,Telerik.TestStudio.Desktop.exe(2756:1),ProjectModel] StandaloneHost.EditControlledFiles() : Project is offline or uncontrolled; making files writeable
    [07/18 10:17:39,Telerik.TestStudio.Desktop.exe(2756:1),ProjectModel] StandaloneHost.EditControlledFiles() : ------- Function End -------
    [07/18 10:18:38,Telerik.TestStudio.RemoteExecutor.exe(1696:11)] First trace message from pool unnamed thread (managed ID = 11, native ID = 3220).
    [07/18 10:18:38,Telerik.TestStudio.RemoteExecutor.exe(1696:11),Execution] RunningTestsController.StartTest() : Test run requested for Local path=D:\BurnSitesBackupTest
    [07/18 10:18:38,Telerik.TestStudio.RemoteExecutor.exe(1696:10)] First trace message from pool unnamed thread (managed ID = 10, native ID = 3680).
    [07/18 10:18:38,Telerik.TestStudio.RemoteExecutor.exe(1696:10),Uncategorized] BugTrackersLoader.LoadSystems() : ------- Function Start -------
    [07/18 10:18:38,Telerik.TestStudio.RemoteExecutor.exe(1696:10),Error] <>c__DisplayClass4.<RegisterResolver>b__1() : EXCEPTION! (see below)
         Situation: Exception trying to resolve dependency: Microsoft.TeamFoundation.Client, Version=9.0.0.0, Culture=neutral, PublicKeyToken=b03f5f7f11d50a3a
         Outer Exception Type: System.IO.FileNotFoundException
         Message: Could not load file or assembly 'Microsoft.TeamFoundation.Client, Version=12.0.0.0, Culture=neutral, PublicKeyToken=b03f5f7f11d50a3a' or one of its dependencies. The system cannot find the file specified.
         HRESULT: 0x80070002 (Official ID (if app.) = 2147942402, Error Bit = FAILED, Facility = FACILITY_WIN32, Code = ERROR_FILE_NOT_FOUND)
         Call Stack:
              at System.Reflection.RuntimeAssembly._nLoad(AssemblyName fileName, String codeBase, Evidence assemblySecurity, RuntimeAssembly locationHint, StackCrawlMark& stackMark, IntPtr pPrivHostBinder, Boolean throwOnFileNotFound, Boolean forIntrospection, Boolean suppressSecurityChecks)
              at System.Reflection.RuntimeAssembly.nLoad(AssemblyName fileName, String codeBase, Evidence assemblySecurity, RuntimeAssembly locationHint, StackCrawlMark& stackMark, IntPtr pPrivHostBinder, Boolean throwOnFileNotFound, Boolean forIntrospection, Boolean suppressSecurityChecks)
              at System.Reflection.RuntimeAssembly.InternalLoadAssemblyName(AssemblyName assemblyRef, Evidence assemblySecurity, RuntimeAssembly reqAssembly, StackCrawlMark& stackMark, IntPtr pPrivHostBinder, Boolean throwOnFileNotFound, Boolean forIntrospection, Boolean suppressSecurityChecks)
              at System.Reflection.RuntimeAssembly.InternalLoad(String assemblyString, Evidence assemblySecurity, StackCrawlMark& stackMark, IntPtr pPrivHostBinder, Boolean forIntrospection)
              at System.Reflection.RuntimeAssembly.InternalLoad(String assemblyString, Evidence assemblySecurity, StackCrawlMark& stackMark, Boolean forIntrospection)
              at System.Reflection.Assembly.Load(String assemblyString)
              at ArtOfTest.Common.BaseDependencyLoader.<>c__DisplayClass4.<RegisterResolver>b__1(Object o, ResolveEventArgs e)
    [07/18 10:18:38,Telerik.TestStudio.RemoteExecutor.exe(1696:10),Error] <>c__DisplayClass4.<RegisterResolver>b__1() : EXCEPTION! (see below)
         Situation: Exception trying to resolve dependency: Microsoft.TeamFoundation.Client, Version=11.0.0.0, Culture=neutral, PublicKeyToken=b03f5f7f11d50a3a
         Outer Exception Type: System.IO.FileNotFoundException
         Message: Could not load file or assembly 'Microsoft.TeamFoundation.Client, Version=9.0.0.0, Culture=neutral, PublicKeyToken=b03f5f7f11d50a3a' or one of its dependencies. The system cannot find the file specified.
         HRESULT: 0x80070002 (Official ID (if app.) = 2147942402, Error Bit = FAILED, Facility = FACILITY_WIN32, Code = ERROR_FILE_NOT_FOUND)
         Call Stack:
              at System.Reflection.RuntimeAssembly._nLoad(AssemblyName fileName, String codeBase, Evidence assemblySecurity, RuntimeAssembly locationHint, StackCrawlMark& stackMark, IntPtr pPrivHostBinder, Boolean throwOnFileNotFound, Boolean forIntrospection, Boolean suppressSecurityChecks)
              at System.Reflection.RuntimeAssembly.nLoad(AssemblyName fileName, String codeBase, Evidence assemblySecurity, RuntimeAssembly locationHint, StackCrawlMark& stackMark, IntPtr pPrivHostBinder, Boolean throwOnFileNotFound, Boolean forIntrospection, Boolean suppressSecurityChecks)
              at System.Reflection.RuntimeAssembly.InternalLoadAssemblyName(AssemblyName assemblyRef, Evidence assemblySecurity, RuntimeAssembly reqAssembly, StackCrawlMark& stackMark, IntPtr pPrivHostBinder, Boolean throwOnFileNotFound, Boolean forIntrospection, Boolean suppressSecurityChecks)
              at System.Reflection.RuntimeAssembly.InternalLoad(String assemblyString, Evidence assemblySecurity, StackCrawlMark& stackMark, IntPtr pPrivHostBinder, Boolean forIntrospection)
              at System.Reflection.RuntimeAssembly.InternalLoad(String assemblyString, Evidence assemblySecurity, StackCrawlMark& stackMark, Boolean forIntrospection)
              at System.Reflection.Assembly.Load(String assemblyString)
              at ArtOfTest.Common.BaseDependencyLoader.<>c__DisplayClass4.<RegisterResolver>b__1(Object o, ResolveEventArgs e)
    [07/18 10:18:38,Telerik.TestStudio.RemoteExecutor.exe(1696:10),Error] <>c__DisplayClass4.<RegisterResolver>b__1() : EXCEPTION! (see below)
         Situation: Exception trying to resolve dependency: Microsoft.TeamFoundation.Client, Version=10.0.0.0, Culture=neutral, PublicKeyToken=b03f5f7f11d50a3a
         Outer Exception Type: System.IO.FileNotFoundException
         Message: Could not load file or assembly 'Microsoft.TeamFoundation.Client, Version=11.0.0.0, Culture=neutral, PublicKeyToken=b03f5f7f11d50a3a' or one of its dependencies. The system cannot find the file specified.
         HRESULT: 0x80070002 (Official ID (if app.) = 2147942402, Error Bit = FAILED, Facility = FACILITY_WIN32, Code = ERROR_FILE_NOT_FOUND)
         Call Stack:
              at System.Reflection.RuntimeAssembly._nLoad(AssemblyName fileName, String codeBase, Evidence assemblySecurity, RuntimeAssembly locationHint, StackCrawlMark& stackMark, IntPtr pPrivHostBinder, Boolean throwOnFileNotFound, Boolean forIntrospection, Boolean suppressSecurityChecks)
              at System.Reflection.RuntimeAssembly.nLoad(AssemblyName fileName, String codeBase, Evidence assemblySecurity, RuntimeAssembly locationHint, StackCrawlMark& stackMark, IntPtr pPrivHostBinder, Boolean throwOnFileNotFound, Boolean forIntrospection, Boolean suppressSecurityChecks)
              at System.Reflection.RuntimeAssembly.InternalLoadAssemblyName(AssemblyName assemblyRef, Evidence assemblySecurity, RuntimeAssembly reqAssembly, StackCrawlMark& stackMark, IntPtr pPrivHostBinder, Boolean throwOnFileNotFound, Boolean forIntrospection, Boolean suppressSecurityChecks)
              at System.Reflection.RuntimeAssembly.InternalLoad(String assemblyString, Evidence assemblySecurity, StackCrawlMark& stackMark, IntPtr pPrivHostBinder, Boolean forIntrospection)
              at System.Reflection.RuntimeAssembly.InternalLoad(String assemblyString, Evidence assemblySecurity, StackCrawlMark& stackMark, Boolean forIntrospection)
              at System.Reflection.Assembly.Load(String assemblyString)
              at ArtOfTest.Common.BaseDependencyLoader.<>c__DisplayClass4.<RegisterResolver>b__1(Object o, ResolveEventArgs e)
    [07/18 10:18:38,Telerik.TestStudio.RemoteExecutor.exe(1696:10),Error] BugTrackersLoader.LoadSystems() : Telerik.TestStudio.TFSBugTracker.TFSBugTracker could not be instantiated. Exception: Exception has been thrown by the target of an invocation.

  3. Boyan Boev
    Admin
    Boyan Boev avatar
    1045 posts

    Posted 22 Jul 2015 Link to this post

    Hi,

    We have a bug regarding the scheduling in the latest version which you can track here.

    I hope this will be fixed as soon as possible. Unfortunately in order to use the scheduling functionality you should install the previous version of Test Studio.

    Thank you for your understanding.

    Regards,
    Boyan Boev
    Telerik
     
    The New Release of Telerik Test Studio Is Here! Download, install,
    and send us your feedback!
Back to Top