Fails to build in 1.0

Thread is closed for posting
2 posts, 0 answers
  1. Porcha
    Porcha avatar
    1 posts
    Member since:
    Mar 2015

    Posted 09 May 2015 Link to this post

    I get this error when I try and build from AppBuilder in visual studio. It was working ok prior to the 1.0 release. I have copied the files into a new project as stated in other threads.

     Any idea how I can fix it?

     Thanks.

     

    Building package: [D:\Dropbox\Telerik\PhysioTelerik\PhysioTelerik\obj\Debug\PhysioNative.zip]
    Project files uploaded to the cloud.
    Sending build request for project PhysioNative with parameters ProjectTypeGuids={F0A65104-D4F4-4012-B799-F612D75820F6}
    Platform=iOS
    MobileProvisionIdentifier=a93c8ab9-c5f1-45dc-8183-42961806cf26
    iOSCodesigningIdentity=iPhone Developer Peter Messenger (AHBRFWN2SQ)
    AndroidCodesigningIdentity=
    Configuration=Debug
    WP8CompanyHubApp=
    BuildForiOSSimulator=
    LiveSyncToken=J8x/VGAOpMGQRbuySoPopkrkU/br3xv9avQ7XMblM8o2K+WE6yJDdpbGUrSN2R/LzidjT7FcbWozZz9KaCftsnsn86/xEl0C8CHhcGmHWwMEu/svKGr6t70eVWnKGK8c.
    C:\Users\Peter\AppData\Local\Microsoft\VisualStudio\12.0\Extensions\jyrdol2y.zwn\Targets\Build.targets(188,3): error : Server build failed. Server output: Project "PhysioNative.tmp.proj" (default targets):
    Error: [xcode-build] Copy /tmp/builds/FP3SoarRe6uc1ANnmU/app/output/NativeScript0100/platforms/ios/NativeScript0100/Resources/icons/Default-568h@2x.png: Can't find /tmp/builds/FP3SoarRe6uc1ANnmU/app/output/NativeScript0100/platforms/ios/NativeScript0100/Resources/icons/Default-568h@2x.png
    Command /Applications/Xcode.app/Contents/Developer/Platforms/iPhoneOS.platform/Developer/usr/bin/copypng failed with exit code 1
    Error: [xcode-build] Copy /tmp/builds/FP3SoarRe6uc1ANnmU/app/output/NativeScript0100/platforms/ios/NativeScript0100/Resources/icons/Default-Landscape.png: Can't find /tmp/builds/FP3SoarRe6uc1ANnmU/app/output/NativeScript0100/platforms/ios/NativeScript0100/Resources/icons/Default-Landscape.png
    Command /Applications/Xcode.app/Contents/Developer/Platforms/iPhoneOS.platform/Developer/usr/bin/copypng failed with exit code 1
    Error: 'Build failed with error code 2'
    Done building project "PhysioNative.tmp.proj" -- FAILED.
    .
    Done building project "PhysioTelerik.iceproj" -- FAILED.

    Build FAILED.

  2. Vlad
    Admin
    Vlad avatar
    11100 posts

    Posted 12 May 2015 Link to this post

    Hi,

    Let's keep the conversation in this thread.

    Regards,
    Vlad
    Telerik
     

    See What's Next in App Development. Register for TelerikNEXT.

     
Back to Top